Benzene, 1-ethyl-2-(1-methylpropyl)

Kovats' RI, non-polar column, isothermal

Data compiled by: NIST Mass Spectrometry Data Center, William E. Wallace, director

Column type CapillaryCapillaryCapillary
Active phase HP-1HP-1OV-101
Column length (m) 25.25.50.
Carrier gas N2N2He
Substrate
Column diameter (mm) 0.200.200.20
Phase thickness (μm)
Temperature (C) 100.100.100.
I 1177.1178.1178.
ReferenceZhang, Li, et al., 1992Zhang, Li, et al., 1992Matisová, Kovacicová, et al., 1989
Comment MSDC-RI MSDC-RI MSDC-RI

References

Zhang, Li, et al., 1992
Zhang, M.J.; Li, S.D.; Chen, B.J., Compositional studies of high-temperature coal tar by GC/FTIR analysis of light oil fractions, Chromatographia, 1992, 33, 3/4, 138-146, https://doi.org/10.1007/BF02275894 . [all data]

Matisová, Kovacicová, et al., 1989
Matisová, E.; Kovacicová, E.; Ha, P.T.; Kolek, E.; Engewald, W., Identification of alkylbenzenes up to C12 by capillary gas chromatography-mass spectrometry. II. Retention indices on OV-101 columns and retention-molecular structure correlations, J. Chromatogr., 1989, 475, 2, 113-123, https://doi.org/10.1016/S0021-9673(01)89667-9 . [all data]