Indole, 3-(2-pentanoyloxyethyl), 5-methoxy, TMS

Normal alkane RI, non-polar column, temperature ramp

View large format table.

Column type Active phase I Reference Comment
PackedOV-12385.Francis, Smith, et al., 1980He, 10. K/min; Column length: 1.5 m; Tstart: 180. C; Tend: 320. C

References

Francis, Smith, et al., 1980
Francis, P.; Smith, I.; Finnie, M.D.A., Mass spectrometric and chromatographic characteristics of neutral and acidic 5-methoxyindoles and some related compounds, Biomed. Mass Spectrom., 1980, 7, 7, 294-300, https://doi.org/10.1002/bms.1200070706 . [all data]