Brassicasterol, TMS

Normal alkane RI, non-polar column, isothermal

Data compiled by: NIST Mass Spectrometry Data Center, William E. Wallace, director

Column type Capillary
Active phase OV-1
Column length (m) 25.
Carrier gas Helium
Substrate
Column diameter (mm) 0.50
Phase thickness (μm)
Temperature (C) 265.
I 3185.
ReferenceBrooks, Cole, et al., 1980
Comment MSDC-RI

References

Brooks, Cole, et al., 1980
Brooks, C.J.W.; Cole, W.J.; McIntyre, H.B.; Smith, A.G., Selective reactions in the analysis and characterization of steroids by gas chromatography-mass spectrometry, Lipids, 1980, 15, 9, 745-755, https://doi.org/10.1007/BF02534028 . [all data]