11-Nonacosene

Normal alkane RI, non-polar column, temperature ramp

Data compiled by: NIST Mass Spectrometry Data Center, William E. Wallace, director

Column type Capillary
Active phase Dexsil 300
Column length (m) 15.
Carrier gas
Substrate
Column diameter (mm)
Phase thickness (μm)
Tstart (C) 50.
Tend (C) 370.
Heat rate (K/min) 5.
Initial hold (min)
Final hold (min)
I 2875.
ReferenceLockey, 1978
Comment MSDC-RI

References

Lockey, 1978
Lockey, K.H., The adult cuticular hydrocarbons of Tenebrio Molitor L. and Tenebrio Obscurus F. (Coleoptera: Tenebrionidae), Insect Biochem., 1978, 8, 4, 237-250, https://doi.org/10.1016/0020-1790(78)90032-X . [all data]