5α-Pregnane-3α,11β,20α-triol, TMSO-TMS

Normal alkane RI, non-polar column, temperature ramp

Data compiled by: NIST Mass Spectrometry Data Center, William E. Wallace, director

Column type CapillaryCapillaryCapillary
Active phase SE-52SE-52SE-52
Column length (m) 19.19.19.
Carrier gas HeliumHeliumHelium
Substrate
Column diameter (mm) 0.400.400.40
Phase thickness (μm)
Tstart (C) 160.160.160.
Tend (C) 260.260.260.
Heat rate (K/min) 2.2.2.
Initial hold (min)
Final hold (min)
I 2913.2918.2911.
ReferenceHonour, Tourniaire, et al., 1978Honour, Tourniaire, et al., 1978Honour, Tourniaire, et al., 1978
Comment MSDC-RI MSDC-RI MSDC-RI

References

Honour, Tourniaire, et al., 1978
Honour, J.W.; Tourniaire, J.; Biglieri, E.G.; Shackleton, C.H.L., Urinary steroid excretion in 17alpha-hydroxylase deficiency, J. Steroid Biochem., 1978, 9, 6, 495-505, https://doi.org/10.1016/0022-4731(78)90115-2 . [all data]