Heptyl-1-tetrahydrocannabinol, TMS

Normal alkane RI, non-polar column, temperature ramp

View large format table.

Column type Active phase I Reference Comment
PackedSe-302545.Harvey, 1977N2, Gas Chrom Q, 2. K/min; Column length: 2.0 m; Tstart: 150. C; Tend: 290. C

References

Harvey, 1977
Harvey, D.J., Allyldimethylsilyl ethers as derivatives for the characterization of steroids and cannabinoids by combined gas chromatography and mass spectrometry, Biomed. Mass Spectrom., 1977, 4, 4, 265-274, https://doi.org/10.1002/bms.1200040414 . [all data]