5β-Pregnan-3α,20β-diol, allyl-DMS

Normal alkane RI, non-polar column, temperature ramp

Data compiled by: NIST Mass Spectrometry Data Center, William E. Wallace, director

Column type Packed
Active phase SE-30
Column length (m) 2.0
Carrier gas N2
Substrate Gas Chrom Q
Column diameter (mm)
Phase thickness (μm)
Tstart (C) 150.
Tend (C) 290.
Heat rate (K/min) 2.
Initial hold (min)
Final hold (min)
I 3143.
ReferenceHarvey, 1977
Comment MSDC-RI

References

Harvey, 1977
Harvey, D.J., Allyldimethylsilyl ethers as derivatives for the characterization of steroids and cannabinoids by combined gas chromatography and mass spectrometry, Biomed. Mass Spectrom., 1977, 4, 4, 265-274, https://doi.org/10.1002/bms.1200040414 . [all data]