Tyrosine, MTH-TMS

Normal alkane RI, non-polar column, isothermal

Data compiled by: NIST Mass Spectrometry Data Center, William E. Wallace, director

Column type Packed
Active phase SE-30
Column length (m) 1.75
Carrier gas Nitrogen
Substrate Supelcoport (80-100 mesh)
Column diameter (mm)
Phase thickness (μm)
Temperature (C) 220.
I 2343.
ReferenceLamkin, Weatherford, et al., 1974
Comment MSDC-RI

References

Lamkin, Weatherford, et al., 1974
Lamkin, W.M.; Weatherford, J.W.; Jones, N.S.; Pan, T.; Ward, D.N., Analysis of methylthiohydantoines of amino acids by gas-liquid chromatography of their trimethylsilyl derivatives, Anal. Biochem., 1974, 58, 2, 422-438, https://doi.org/10.1016/0003-2697(74)90211-5 . [all data]