1,2-bis-(3-phenathryl)ethylene, cis

Normal alkane RI, non-polar column, isothermal

View large format table.

Column type Active phase Temperature (C) I Reference Comment
PackedOV-1270.3775.Nicoud, Balavoine, et al., 1972Nitrogen, Gas-Chrom Q
PackedOV-1290.3835.Nicoud, Balavoine, et al., 1972Nitrogen, Gas-Chrom Q
PackedOV-1270.3775.Nicoud, Moradpour, et al., 1972Nitrogen, Gas-Chrom Q (60-80 mesh); Column length: 4. m
PackedOV-1290.3835.Nicoud, Moradpour, et al., 1972Nitrogen, Gas-Chrom Q (60-80 mesh); Column length: 4. m

References

Nicoud, Balavoine, et al., 1972
Nicoud, J.F.; Balavoine, G.; Kagan, H.; Martin, R.H.; Deblecker, M., Chromatographie en phase vapeur d'helicenes et de diaryl-1,2-ethylenes, J. Chromatogr., 1972, 66, 1, 43-53, https://doi.org/10.1016/S0021-9673(01)82926-5 . [all data]

Nicoud, Moradpour, et al., 1972
Nicoud, J.F.; Moradpour, A.; Balavoine, G.; Kagan, H.; Martin, R.H.; Deblecker, M., Chromatographie en phase vapeur d'helicenes et de diaryl-1,2 ethylenes, J. Chromatogr., 1972, 66, 1, 43-53, https://doi.org/10.1016/S0021-9673(01)82926-5 . [all data]