Tricyclo[8.4.0.0(3,8)]dodecane, isomer # 4

Normal alkane RI, non-polar column, isothermal

Data compiled by: NIST Mass Spectrometry Data Center, William E. Wallace, director

Column type CapillaryCapillary
Active phase SE-30SE-30
Column length (m) 50.50.
Carrier gas N2N2
Substrate
Column diameter (mm) 0.250.25
Phase thickness (μm)
Temperature (C) 150.175.
I 1549.1576.
ReferenceVanek, Podrouzková, et al., 1970Vanek, Podrouzková, et al., 1970
Comment MSDC-RI MSDC-RI

References

Vanek, Podrouzková, et al., 1970
Vanek, J.; Podrouzková, B.; Landa, S., Gas chromatographic behaviour of tricyclic saturated hydrocarbons. The relation between the retention indices and the stereochemical structure of the tricyclanes, J. Chromatogr., 1970, 52, 77-86, https://doi.org/10.1016/S0021-9673(01)96546-X . [all data]