5α-Oestrane

Normal alkane RI, non-polar column, isothermal

Data compiled by: NIST Mass Spectrometry Data Center, William E. Wallace, director

Column type PackedPacked
Active phase OV-1OV-1
Column length (m) 1.501.50
Carrier gas N2N2
Substrate Gas-Chrom QGas-Chrom Q
Column diameter (mm)
Phase thickness (μm)
Temperature (C) 200.200.
I 1875.1880.
ReferenceDehennin and Scholler, 1969Dehennin and Scholler, 1969
Comment MSDC-RI MSDC-RI

References

Dehennin and Scholler, 1969
Dehennin, L.; Scholler, R., Correlation entre la structure moleculaire de quelques steroides en C18 et leurs grandeurs de retention en chromatographie en phase gazeuse, J. Steroid Biochem., 1969, 1, 1, 57-76, https://doi.org/10.1016/0022-4731(69)90009-0 . [all data]