5β-Pregnan-3α,17α,21-triol-11,20-dione, MO-TMS

Normal alkane RI, non-polar column, isothermal

View large format table.

Column type Active phase Temperature (C) I Reference Comment
PackedOV-1180. - 200.3121.Horning, Moss, et al., 1968N2, Gas Chrom P; Column length: 3.7 m

References

Horning, Moss, et al., 1968
Horning, M.G.; Moss, A.M.; Horning, E.C., Formation and gas-liquid chromatographic behavior of isomeric steroid ketone methoxime derivatives, Anal. Biochem., 1968, 22, 2, 284-294, https://doi.org/10.1016/0003-2697(68)90318-7 . [all data]