5α-Androstan-3α-ol-17-one (Androsterone), MO

Normal alkane RI, non-polar column, isothermal

Data compiled by: NIST Mass Spectrometry Data Center, William E. Wallace, director

Column type Packed
Active phase OV-1
Column length (m) 3.7
Carrier gas N2
Substrate Gas Chrom P
Column diameter (mm)
Phase thickness (μm)
Temperature (C) 180. - 200.
I 2472.
ReferenceHorning, Moss, et al., 1968
Comment MSDC-RI

References

Horning, Moss, et al., 1968
Horning, M.G.; Moss, A.M.; Horning, E.C., Formation and gas-liquid chromatographic behavior of isomeric steroid ketone methoxime derivatives, Anal. Biochem., 1968, 22, 2, 284-294, https://doi.org/10.1016/0003-2697(68)90318-7 . [all data]