Tocotrienol, 5,7,8-trimethyl

Normal alkane RI, non-polar column, isothermal

View large format table.

Column type Active phase Temperature (C) I Reference Comment
PackedSE-30235.3208.Slover, Shelley, et al., 1967He, Anakrom; Column length: 4.6 m

References

Slover, Shelley, et al., 1967
Slover, H.T.; Shelley, L.M.; Burks, T.L., Identification and estimation of tocopherols by gas-liquid chromatography, J. Amer. Oil Chem. Soc., 1967, 44, 3, 161-166, https://doi.org/10.1007/BF02545257 . [all data]