serine, N(O,S)-isoBOC TBDMS

Normal alkane RI, non-polar column, temperature ramp

View large format table.

Column type Active phase I Reference Comment
CapillaryDB-51903.1Oh, Mabry, et al., 199530. m/0.25 mm/0.25 μm, N2, 150. C @ 2. min, 3. K/min; Tend: 280. C

References

Oh, Mabry, et al., 1995
Oh, C.-H.; Mabry, T.J.; Kim, K.-R.; Kim, J.-H., GC-MS Analysis of nonprotein amino acids in Gymnocladus dioicus as N(O,S)-Isobutyloxycarbonyl silyl derivatives, J. Chromatogr. Sci., 1995, 33, 7, 399-404, https://doi.org/10.1093/chromsci/33.7.399 . [all data]