1,2,4-trimethyl-3,6-bis-(chloromethyl)benzene

Normal alkane RI, non-polar column, temperature ramp

Data compiled by: NIST Mass Spectrometry Data Center, William E. Wallace, director

Column type Capillary
Active phase OV-101
Column length (m) 25.
Carrier gas N2
Substrate
Column diameter (mm) 0.2
Phase thickness (μm)
Tstart (C) 60.
Tend (C) 240.
Heat rate (K/min) 6.
Initial hold (min)
Final hold (min)
I 1710.
ReferenceZenkevich and Makarov, 2007
Comment MSDC-RI

References

Zenkevich and Makarov, 2007
Zenkevich, I.G.; Makarov, A.A., Identification of Alkylarene Chloromethylation Products Using Gas-Chromatographic Retention Indices, Russian Journal of General Chemistry, 2007, 77, 4, 611-619, https://doi.org/10.1134/S1070363207040196 . [all data]