3-Methyl-3-sulfanylbutyl Butanoate

Normal alkane RI, non-polar column, temperature ramp

Data compiled by: NIST Mass Spectrometry Data Center, William E. Wallace, director

Column type Capillary
Active phase SPB-1
Column length (m) 30.
Carrier gas He
Substrate
Column diameter (mm) 0.25
Phase thickness (μm) 0.25
Tstart (C) 50.
Tend (C) 240.
Heat rate (K/min) 5.
Initial hold (min) 5.
Final hold (min)
I 1266.
ReferenceStarkenmann, Niclass, et al., 2007
Comment MSDC-RI

References

Starkenmann, Niclass, et al., 2007
Starkenmann, C.; Niclass, Y.; Escher, S., Volatile Organic Sulfur-Containing Constituents in Poncirus trifoliata (L.) Raf. (Rutaceae), J. Agric. Food Chem., 2007, 55, 11, 4511-4517, https://doi.org/10.1021/jf063453h . [all data]