2-methoxy-5-vinylphenol

Van Den Dool and Kratz RI, non-polar column, temperature ramp

View large format table.

Column type Active phase I Reference Comment
CapillaryDB-51329.Scheidig, Czerny, et al., 200730. m/0.32 mm/0.24 μm, He, 40. C @ 2. min, 6. K/min, 240. C @ 10. min

Van Den Dool and Kratz RI, polar column, temperature ramp

View large format table.

Column type Active phase I Reference Comment
CapillaryDB-FFAP2223.Scheidig, Czerny, et al., 200730. m/0.32 mm/0.24 μm, He, 40. C @ 2. min, 6. K/min, 240. C @ 10. min

References

Scheidig, Czerny, et al., 2007
Scheidig, C.; Czerny, M.; Schieberle, P., Changes in Key Odorants of Raw Coffee Beans during Storage under Defined Conditions, J. Agric. Food Chem., 2007, 55, 14, 5768-5775, https://doi.org/10.1021/jf070488o . [all data]