gibbilimbol A

Normal alkane RI, non-polar column, temperature ramp

View large format table.

Column type Active phase I Reference Comment
CapillaryBPX-52016.Rali, Wossa, et al., 200750. m/0.22 mm/1. μm, He, 50. C @ 1. min, 4. K/min, 300. C @ 10. min

References

Rali, Wossa, et al., 2007
Rali, T.; Wossa, S.W.; Leach, D.N.; Waterman, P.G., Volatile chemical constituents of Piper aduncum L and Piper gibbilimbum C. DC (Piperaceae) from Papua New Guinea, Molecules, 2007, 12, 3, 389-394, https://doi.org/10.3390/12030389 . [all data]