1-Nitrohexadec-1-ene

Normal alkane RI, non-polar column, custom temperature program

Data compiled by: NIST Mass Spectrometry Data Center, William E. Wallace, director

Column type Capillary
Active phase ZB-5
Column length (m) 30.
Carrier gas
Substrate
Column diameter (mm) 0.25
Phase thickness (μm) 0.25
Program 60C => 3C/min => 240C 20C/min => 320C
I 2092.
ReferencePiskorski R., Hanus R., et al., 2007
Comment MSDC-RI

References

Piskorski R., Hanus R., et al., 2007
Piskorski R.; Hanus R.; Vasickova S.; Cvacka J.; Sobotnik J.; Svatos A.; Valterova I., Nitroalkenes and sesquiterpene hydrocarbons from the frontal gland of three Prorhinotermes termite species, J. Chem. Ecol., 2007, 33, 9, 1787-1794, https://doi.org/10.1007/s10886-007-9341-y . [all data]