17α-hydroxy-5β-androstan-3-one (3-enol), per-TMS

Normal alkane RI, non-polar column, temperature ramp

View large format table.

Column type Active phase I Reference Comment
CapillaryUltra-12368.Parr, Zapp, et al., 200717. m/0.2 mm/0.11 μm, He, 20. K/min, 320. C @ 2. min; Tstart: 140. C
CapillaryHP-5MS2432.Parr, Zapp, et al., 200716.5 m/0.25 mm/0.25 μm, He, 20. K/min, 320. C @ 2. min; Tstart: 140. C

References

Parr, Zapp, et al., 2007
Parr, M.K.; Zapp, J.; Becker, M.; Opfermann, G.; Bartz, U.; Schanzer, W., Steroidal isomers with uniform mass spectra of their per-TMS derivatives: Synthesis of 17-hydroxyandrostan-3-ones, androst-1-, and -4-ene-3,17-diols, Steroids, 2007, 72, 6-7, 545-551, https://doi.org/10.1016/j.steroids.2007.03.006 . [all data]