15-Copaenol

Normal alkane RI, non-polar column, temperature ramp

View large format table.

Column type Active phase I Reference Comment
CapillaryMethyl Silicone1563.Ozcan and Chalchat, 2007Helium, 3. K/min; Column length: 50. m; Column diameter: 0.25 mm; Tstart: 50. C; Tend: 240. C

References

Ozcan and Chalchat, 2007
Ozcan, M.M.; Chalchat, J.C., Chemical Composition od Carrot Seeds (Daucus carota L.) Cultivated in Turkey: Characterization of the Seed Oil and Essential Oil, Grasas y Aceites, 2007, 58, 4, 359-365. [all data]