(Z,Z)-5,7-Dodecadienal

Van Den Dool and Kratz RI, non-polar column, custom temperature program

View large format table.

Column type Active phase I Reference Comment
CapillaryDB-51452.Kong, Zhang, et al., 200730. m/0.25 mm/0.25 μm; Program: not specified

Van Den Dool and Kratz RI, polar column, temperature ramp

View large format table.

Column type Active phase I Reference Comment
CapillaryDB-Wax1909.Kong, Zhang, et al., 200730. m/0.25 mm/0.25 μm, He, 60. C @ 1. min, 6. K/min, 220. C @ 10. min

Normal alkane RI, non-polar column, temperature ramp

View large format table.

Column type Active phase I Reference Comment
CapillaryDB-51452.Kong, Zhang, et al., 2007, 230. m/0.25 mm/0.25 μm, Nitrogen, 80. C @ 1. min, 8. K/min, 220. C @ 10. min

Normal alkane RI, polar column, temperature ramp

View large format table.

Column type Active phase I Reference Comment
CapillaryDB-Wax1909.Kong, Zhang, et al., 2007, 230. m/0.25 mm/0.25 μm, Nitrogen, 80. C @ 1. min, 10. K/min, 200. C @ 30. min

References

Kong, Zhang, et al., 2007
Kong, X.B.; Zhang, Z.; Zhao, C.H.; Wang, H.B., Female sex pheromone of the Yunnan pine caterpillar moth Dendorlimus Houi: first (E,Z)-isomers in pheromone components of Dendrolimus spp, J. Chem. Ecol., 2007, 33, 7, https://doi.org/10.1007/s10886-007-9313-2 . [all data]

Kong, Zhang, et al., 2007, 2
Kong, X.B.; Zhang, Z.; Zhao, C.H.; Wang, H.B., Female sex pheromone of the Yunnan pine caterpillar moth Dendrolimus Houi: first (E,Z)-isomer in pheromone components of Dendrolimus spp, J. Chem. Ecol., 2007, 33, 7, 1316-1327, https://doi.org/10.1007/s10886-007-9313-2 . [all data]