δ-Thujone

Normal alkane RI, non-polar column, temperature ramp

View large format table.

Column type Active phase I Reference Comment
CapillaryDB-51103.Ghasemi, Yamini, et al., 200730. m/0.25 mm/0.25 μm, He, 60. C @ 3. min, 30. K/min; Tend: 210. C

References

Ghasemi, Yamini, et al., 2007
Ghasemi, E.; Yamini, Y.; Bahramifar, N.; Sefidkon, F., Comparative analysis of the oil and supercritical CO2 extract of Artemisia sieberi, J. Food Eng., 2007, 79, 1, 306-311, https://doi.org/10.1016/j.jfoodeng.2006.01.059 . [all data]