3'-acetylechiupinine

Normal alkane RI, non-polar column, custom temperature program

Data compiled by: NIST Mass Spectrometry Data Center, William E. Wallace, director

Column type Capillary
Active phase DB-1
Column length (m) 30.
Carrier gas
Substrate
Column diameter (mm) 0.32
Phase thickness (μm)
Program not specified
I 2557.
ReferenceFrolich, Ober, et al., 2007
Comment MSDC-RI

References

Frolich, Ober, et al., 2007
Frolich, C.; Ober, D.; Hartmann, T., Tissue distribution, core biosynthesis and diversification of pyrrolizidine alkaloids of the lycopsamine type in three Boraginaceae species, Phytochemistry, 2007, 68, 7, 1026-1037, https://doi.org/10.1016/j.phytochem.2007.01.002 . [all data]