Cedren-15-oic acid

Normal alkane RI, non-polar column, temperature ramp

Data compiled by: NIST Mass Spectrometry Data Center, William E. Wallace, director

Column type Capillary
Active phase HP-5MS
Column length (m) 25.
Carrier gas He
Substrate
Column diameter (mm) 0.25
Phase thickness (μm) 0.25
Tstart (C) 50.
Tend (C) 300.
Heat rate (K/min) 5.
Initial hold (min) 5.
Final hold (min)
I 1907.
ReferenceChampagnat, Bessière, et al., 2007
Comment MSDC-RI

References

Champagnat, Bessière, et al., 2007
Champagnat, P.; Bessière, J.-M.; Chezal, J.-M.; Chalchat André-Paul Carnat4*, J.-C., New compounds from the essential oil of Vetiveria nigritana roots from Mali, Flavour Fragr. J., 2007, 22, 6, 488-493, https://doi.org/10.1002/ffj.1828 . [all data]