(-)-Myltayl-4-ene

Van Den Dool and Kratz RI, non-polar column, custom temperature program

Data compiled by: NIST Mass Spectrometry Data Center, William E. Wallace, director

Column type Capillary
Active phase CP Sil 5 CB
Column length (m)
Carrier gas
Substrate
Column diameter (mm)
Phase thickness (μm)
Program not specified
I 1380.
ReferenceAdio, von Reuß, et al., 2007
Comment MSDC-RI

Normal alkane RI, non-polar column, temperature ramp

Data compiled by: NIST Mass Spectrometry Data Center, William E. Wallace, director

Column type Capillary
Active phase CP Sil 5 CB
Column length (m) 25.
Carrier gas H2
Substrate
Column diameter (mm)
Phase thickness (μm)
Tstart (C) 50.
Tend (C) 230.
Heat rate (K/min) 3.
Initial hold (min)
Final hold (min)
I 1380.
ReferenceAdio, 2005
Comment MSDC-RI

References

Adio, von Reuß, et al., 2007
Adio, A.M.; von Reuß, S.H.; Paul, C.; Muhle, H.; Konig, W.A., Sesquiterpenoid constituents of the liverwort Marsupella aquatica, Tetrahedron: Asymmetry, 2007, 18, 10, 1245-1253, https://doi.org/10.1016/j.tetasy.2007.05.020 . [all data]