1,4-dimethyl-diamantane

Kovats' RI, non-polar column, temperature ramp

Data compiled by: NIST Mass Spectrometry Data Center, William E. Wallace, director

Column type Capillary
Active phase HP-5MS
Column length (m) 30.
Carrier gas
Substrate
Column diameter (mm) 0.25
Phase thickness (μm) 0.25
Tstart (C) 50.
Tend (C) 300.
Heat rate (K/min) 6.
Initial hold (min) 2.
Final hold (min)
I 1572.
ReferenceYang, Wang, et al., 2006
Comment MSDC-RI

References

Yang, Wang, et al., 2006
Yang, C.; Wang, Z.D.; Hollebone, B.P.; Peng, X.; Fingas, M.; Landriault, M., GC/MS Quantitation of diamondoid compounds in crude oils and petroleum products, Environmental Forensics, 2006, 7, 4, 377-390, https://doi.org/10.1080/15275920600996396 . [all data]