Phenyl chloropropanethio arsine

Normal alkane RI, non-polar column, temperature ramp

Data compiled by: NIST Mass Spectrometry Data Center, William E. Wallace, director

Column type Capillary
Active phase DB-5MS
Column length (m) 30.
Carrier gas He
Substrate
Column diameter (mm) 0.25
Phase thickness (μm) 0.25
Tstart (C) 40.
Tend (C) 280.
Heat rate (K/min) 10.
Initial hold (min) 1.
Final hold (min) 10.
I 1720.
ReferenceTørnes, Opstad, et al., 2006
Comment MSDC-RI

References

Tørnes, Opstad, et al., 2006
Tørnes, J.A.; Opstad, A.M.; Johnsen, B.A., Determination of organoarsenic warfare agents in sediment samples from Skagerrak by gas chromatography-mass spectrometry, Sci. Total Environ., 2006, 356, 1-3, 235-246, https://doi.org/10.1016/j.scitotenv.2005.03.031 . [all data]