4-iodo-2,5-dimethoxy-β-phenethylamine-M, (O-desmethyl-), isomer 1, di-TFA

Kovats' RI, non-polar column, temperature ramp

View large format table.

Column type Active phase I Reference Comment
CapillaryHP-11970.Theobald, Pütz, et al., 200612. m/0.2 mm/0.33 μm, He, 100. C @ 3. min, 30. K/min, 310. C @ 8. min

References

Theobald, Pütz, et al., 2006
Theobald, D.S.; Pütz, M.; Schneider, E.; Maurer, H.H., New designer drug 4-iodo-2,5-dimethoxy-β-phenethylamine (2C-I): Studies on its metabolism and toxicological detection in rat urine using gas chromatographic/mass spectrometric and capillary electrophoretic/mass spectrometric techniques, J. Mass Spectrom., 2006, 41, 7, 872-886, https://doi.org/10.1002/jms.1045 . [all data]