(2-Methoxy-ethyl)-methyl-propyl-amine

Van Den Dool and Kratz RI, non-polar column, temperature ramp

View large format table.

Column type Active phase I Reference Comment
CapillaryCP Sil 8 CB901.765Lakshmi V.V.S., Reddy T.J., et al., 200630. m/0.25 mm/0.25 μm, He, 50. C @ 2. min, 10. K/min, 280. C @ 5. min

References

Lakshmi V.V.S., Reddy T.J., et al., 2006
Lakshmi V.V.S.; Reddy T.J.; Murty M.R.V.S.; Prabhakar S.; Vairamani M., In situ nucleophilic substitution reaction of N,N-dialkylaminoethyl-2-chlorides monitored by gas chromatography/mass spectrometry, Rapid Commun. Mass Spectrom., 2006, 20, 14, 2209-2214, https://doi.org/10.1002/rcm.2581 . [all data]