2-Propanone - propanal azine

Normal alkane RI, non-polar column, temperature ramp

Data compiled by: NIST Mass Spectrometry Data Center, William E. Wallace, director

Column type Capillary
Active phase OV-101
Column length (m) 25.
Carrier gas N2/He
Substrate
Column diameter (mm) 0.20
Phase thickness (μm) 0.10
Tstart (C) 50.
Tend (C) 250.
Heat rate (K/min) 6.
Initial hold (min)
Final hold (min)
I 828.
ReferenceZenkevich, 2005
Comment MSDC-RI

References

Zenkevich, 2005
Zenkevich, I.G., Experimentally measured retention indices., 2005. [all data]