Ilicic acid, methyl ester

Normal alkane RI, non-polar column, temperature ramp

Data compiled by: NIST Mass Spectrometry Data Center, William E. Wallace, director

Column type Capillary
Active phase DB-5MS
Column length (m) 30.
Carrier gas He
Substrate
Column diameter (mm) 0.25
Phase thickness (μm) 0.25
Tstart (C) 80.
Tend (C) 250.
Heat rate (K/min) 5.
Initial hold (min) 2.
Final hold (min) 9.
I 1966.
ReferenceWatanabe Y., Mihara R., et al., 2005
Comment MSDC-RI

References

Watanabe Y., Mihara R., et al., 2005
Watanabe Y.; Mihara R.; Mitsunaga T.; Yoshimura T., Termite repellent sesquiterpenoids from Callitris glaucophylla heartwood, J. Wood Sci., 2005, 51, 5, 514-519, https://doi.org/10.1007/s10086-004-0683-6 . [all data]