(+)-6,7-epoxyeudesm-3-ene

Normal alkane RI, non-polar column, custom temperature program

Data compiled by: NIST Mass Spectrometry Data Center, William E. Wallace, director

Column type Capillary
Active phase CP Sil 5 CB
Column length (m) 25.
Carrier gas H2
Substrate
Column diameter (mm)
Phase thickness (μm)
Program not specified
I 1787.
ReferenceLu, Paul, et al., 2005
Comment MSDC-RI

References

Lu, Paul, et al., 2005
Lu, R.; Paul, C.; Basar, S.; König, W.A., Sesquiterpene constituents of the liverwort Lophozia ventricosa, Tetrahedron: Asymmetry, 2005, 16, 4, 883-887, https://doi.org/10.1016/j.tetasy.2005.01.019 . [all data]