Nortropan-3β-ol

Kovats' RI, non-polar column, temperature ramp

Data compiled by: NIST Mass Spectrometry Data Center, William E. Wallace, director

Column type Capillary
Active phase DB-1
Column length (m) 30.
Carrier gas He
Substrate
Column diameter (mm) 0.32
Phase thickness (μm)
Tstart (C) 70.
Tend (C) 300.
Heat rate (K/min) 6.
Initial hold (min)
Final hold (min)
I 1160.
ReferenceJenett-Siems, Weigl, et al., 2005
Comment MSDC-RI

References

Jenett-Siems, Weigl, et al., 2005
Jenett-Siems, K.; Weigl, R.; Böhm, A.; Mann, P.; Tofern-Reblin, B.; Ott, S.C.; Ghomian, A.; Kaloga, M.; Siems, K.; Witte, L.; Hilker, M.; Müller, F.; Eich, E., Chemotaxonomy of the pantropical genus Merremia (Convolvulaceae) based on the distribution of tropane alkaloids, Phytochemistry, 2005, 66, 12, 1448-1464, https://doi.org/10.1016/j.phytochem.2005.04.027 . [all data]