5-(2-Hydroxypropyl)-hygrine

Normal alkane RI, non-polar column, custom temperature program

Data compiled by: NIST Mass Spectrometry Data Center, William E. Wallace, director

Column type Capillary
Active phase OV-1
Column length (m) 15.
Carrier gas He
Substrate
Column diameter (mm) 0.317
Phase thickness (μm) 0.25
Program 100 0C (2 min) 15 0C/min -> 250 0C 25 0C/min -> 300 0C (5 min)
I 1451.
ReferenceEi-Shazly and Wink M., 2008
Comment MSDC-RI

References

Ei-Shazly and Wink M., 2008
Ei-Shazly, A.; Wink M., Tropane and pyrrolidine alkaloids from Convolvulus lanatus Vahl, Z. Naturforsch. C:, 2008, 63, 5-6, 321-325. [all data]