3-α-Nicotinyltropin

Kovats' RI, non-polar column, temperature ramp

View large format table.

Column type Active phase I Reference Comment
CapillaryDB-11953.Jenett-Siems, Weigl, et al., 2005He, 6. K/min; Column length: 30. m; Column diameter: 0.32 mm; Tstart: 70. C; Tend: 300. C

Normal alkane RI, non-polar column, temperature ramp

View large format table.

Column type Active phase I Reference Comment
CapillaryDB-11952.Beuerle, 2010He, 6. K/min; Column length: 30. m; Column diameter: 0.32 mm; Tstart: 150. C; Tend: 300. C

References

Jenett-Siems, Weigl, et al., 2005
Jenett-Siems, K.; Weigl, R.; Böhm, A.; Mann, P.; Tofern-Reblin, B.; Ott, S.C.; Ghomian, A.; Kaloga, M.; Siems, K.; Witte, L.; Hilker, M.; Müller, F.; Eich, E., Chemotaxonomy of the pantropical genus Merremia (Convolvulaceae) based on the distribution of tropane alkaloids, Phytochemistry, 2005, 66, 12, 1448-1464, https://doi.org/10.1016/j.phytochem.2005.04.027 . [all data]

Beuerle, 2010
Beuerle, T., MS and RI data. Personal communication., 2010. [all data]