diacrylate of tri-propoxylated glycerol (Acrylic acid 1-[2-(2-acryloyloxy-propoxy)-propoxymethyl]-2-(2-hydroxy-propoxy)-ethyl ester)

Van Den Dool and Kratz RI, non-polar column, temperature ramp

Data compiled by: NIST Mass Spectrometry Data Center, William E. Wallace, director

Column type Capillary
Active phase MDN-5
Column length (m) 30.
Carrier gas He
Substrate
Column diameter (mm) 0.32
Phase thickness (μm) 0.25
Tstart (C) 50.
Tend (C) 320.
Heat rate (K/min) 10.
Initial hold (min) 3.
Final hold (min) 10.
I 2222.
ReferenceYoo, Pace, et al., 2004
Comment MSDC-RI

References

Yoo, Pace, et al., 2004
Yoo, S.J.; Pace, G.V.; Khoo, B.K.; Lech, J.; Hartman, T.G., Mass Spectrometry and Gas Chromatographic Retention Indices of Selected UV/EB-Curable Monomers and Photoinitiators Commonly Used in Food Packaging Print and Coating Formulations, Radtech Report, Radtech Report; Technical Paper, 2004, 8. [all data]