6(E),15-Heptadecadiene, 2,6,12,16-tetramethyl-11-(3-methyl-4-pentenylidene)

Normal alkane RI, non-polar column, custom temperature program

View large format table.

Column type Active phase I Reference Comment
CapillaryHP-52134.Ogihara and Ashi, 2004Program: not specified

References

Ogihara and Ashi, 2004
Ogihara, S.; Ashi, J., Lipids composition in deep sea sediment covered by a bacterial mat collected from the Ryuyo Canyon, off Tokai, JAMSTEC J. Deep Sea Res., 2004, 24, 25-36. [all data]