1-Isopropyl-4-methyl-2-[1,5,9-trimethyl-1-(4-methyl-hexyl)-decyl]-cyclohexane

Normal alkane RI, non-polar column, temperature ramp

Data compiled by: NIST Mass Spectrometry Data Center, William E. Wallace, director

Column type CapillaryCapillary
Active phase HP-1HP-5
Column length (m)
Carrier gas HeHe
Substrate
Column diameter (mm)
Phase thickness (μm)
Tstart (C) 40.40.
Tend (C) 300.300.
Heat rate (K/min) 5.5.
Initial hold (min)
Final hold (min) 10.10.
I 2532.2546.
ReferenceMassé, Belt, et al., 2004Massé, Belt, et al., 2004
Comment MSDC-RI MSDC-RI

References

Massé, Belt, et al., 2004
Massé, G.; Belt, S.T.; Allard, W.G.; Lewis, C.A.; Wakeham, S.G.; Rowland, S.J., Occurrence of novel monocyclic alkenes from diatoms in marine particulate matter and sediments, Org. Geochem., 2004, 35, 7, 813-822, https://doi.org/10.1016/j.orggeochem.2004.03.004 . [all data]