exo-2-(1,1-Dimethylprop-2-ynyloxycarbonyl)bicyclo-[2.2.1]hept-5-ene

Kovats' RI, non-polar column, isothermal

Data compiled by: NIST Mass Spectrometry Data Center, William E. Wallace, director

Column type Packed
Active phase Apiezon N
Column length (m) 3.
Carrier gas He
Substrate Dinokhrom P
Column diameter (mm)
Phase thickness (μm)
Temperature (C) 150.
I 1256.
ReferenceMamedov, 2004
Comment MSDC-RI

References

Mamedov, 2004
Mamedov, E.G., Synthesis and Corrosion-Protective Properties of Acetylenic Esters of Bicyclo[2.2.1]hept-5-ene-2-carboxylic Acid, Russ. J. Appl. Chem. (Engl. Transl.), 2004, 77, 8, 1316-1320, https://doi.org/10.1007/s11167-005-0021-9 . [all data]