endo-2-(1,1-Dimethylprop-2-ynyloxycarbonyl)bicyclo-2.2.1]hept-5-ene

Kovats' RI, non-polar column, isothermal

View large format table.

Column type Active phase Temperature (C) I Reference Comment
PackedApiezon N150.1268.Mamedov, 2004He, Dinokhrom P; Column length: 3. m

References

Mamedov, 2004
Mamedov, E.G., Synthesis and Corrosion-Protective Properties of Acetylenic Esters of Bicyclo[2.2.1]hept-5-ene-2-carboxylic Acid, Russ. J. Appl. Chem. (Engl. Transl.), 2004, 77, 8, 1316-1320, https://doi.org/10.1007/s11167-005-0021-9 . [all data]