5-hydroxy-isobornyl butyrate

Van Den Dool and Kratz RI, non-polar column, temperature ramp

Data compiled by: NIST Mass Spectrometry Data Center, William E. Wallace, director

Column type Capillary
Active phase RTX-5
Column length (m) 30.
Carrier gas He
Substrate
Column diameter (mm) 0.25
Phase thickness (μm) 0.25
Tstart (C) 45.
Tend (C) 300.
Heat rate (K/min) 3.
Initial hold (min) 6.
Final hold (min) 10.
I 1661.
ReferenceDugo, Mondello, et al., 2004
Comment MSDC-RI

References

Dugo, Mondello, et al., 2004
Dugo, P.; Mondello, L.; Zappia, G.; Bonaccorsi, I.; Cotroneo, A.; Russo, M.T., The composition of the volatile fraction and the enantiomeric distribution of five volatile components of faustrime oil (Monocitrus australatica x Fortunella sp. x Citrus aurantifolia), J. Essent. Oil Res., 2004, 16, 4, 328-333, https://doi.org/10.1080/10412905.2004.9698734 . [all data]