(4E,6E)-4,6-hexadecandien-1-ol

Normal alkane RI, non-polar column, temperature ramp

View large format table.

Column type Active phase I Reference Comment
CapillaryHP-51936.Naka, van Vang, et al., 2003He, 100. C @ 2. min, 8. K/min, 240. C @ 15. min; Column length: 30. m; Column diameter: 0.25 mm

References

Naka, van Vang, et al., 2003
Naka, H.; van Vang, L.; Inomata, S.-I.; Ando, T.; Kimura, T.; Honda, H.; Tsuchida, K.; Sakurai, H., Sex pheromone of the persimmon fruit moth, Stathmopoda masinissa: identification and laboratory bioassay of (4E, 6Z)-4,6-hexadecadien-1-ol derivatives, J. Chem. Ecol., 2003, 29, 11, 2447-2459, https://doi.org/10.1023/A:1026301800140 . [all data]