α-Nootkatol

Van Den Dool and Kratz RI, non-polar column, custom temperature program

View large format table.

Column type Active phase I Reference Comment
CapillaryHP-5MS1710.de Kraker, Schurink, et al., 200330. m/0.25 mm/0.25 μm, He; Program: not specified

References

de Kraker, Schurink, et al., 2003
de Kraker, J.-W.; Schurink, M.; Franssen, M.C.R.; König, W.A.; de Groot, A.; Bouwmeester, H.J., Hydroxylation of sesquiterpenes by enzymes from chicory (Cichorium intybus L.) roots, Tetrahedron, 2003, 59, 3, 409-418, https://doi.org/10.1016/S0040-4020(02)01479-5 . [all data]