3-isopropenyl-2,2-dimethylcyclobutane-methanol

Normal alkane RI, non-polar column, temperature ramp

Data compiled by: NIST Mass Spectrometry Data Center, William E. Wallace, director

Column type CapillaryCapillary
Active phase TC-1TC-1
Column length (m) 30.30.
Carrier gas HeHe
Substrate
Column diameter (mm) 0.250.25
Phase thickness (μm) 0.250.25
Tstart (C) 50.50.
Tend (C) 180.180.
Heat rate (K/min) 5.5.
Initial hold (min) 1.1.
Final hold (min)
I 1150.1152.
ReferenceArai T., Sugie H., et al., 2003Arai T., Sugie H., et al., 2003
Comment MSDC-RI MSDC-RI

Normal alkane RI, polar column, temperature ramp

View large format table.

Column type Active phase I Reference Comment
CapillaryFFAP1601.Arai T., Sugie H., et al., 200330. m/0.25 mm/0.25 μm, He, 80. C @ 1. min, 7. K/min; Tend: 210. C
CapillaryFFAP1601.Arai T., Sugie H., et al., 200330. m/0.25 mm/0.25 μm, He, 80. C @ 1. min, 7. K/min; Tend: 210. C

References

Arai T., Sugie H., et al., 2003
Arai T.; Sugie H.; Hiradate S.; Kuwahara S.; Itagaki N.; Nakahata T., Identification of a sex pheromone component of Pseudococcus cryptus, J. Chem. Ecol., 2003, 29, 10, 2213-2223, https://doi.org/10.1023/A:1026214112242 . [all data]