(1R,3R)-3-isopropenyl-2,2-dimethylcyclobutylmethyl 3-methyl-3-butenoate

Normal alkane RI, non-polar column, temperature ramp

View large format table.

Column type Active phase I Reference Comment
CapillaryTC-11526.Arai T., Sugie H., et al., 200330. m/0.25 mm/0.25 μm, He, 50. C @ 1. min, 5. K/min; Tend: 180. C

Normal alkane RI, polar column, temperature ramp

View large format table.

Column type Active phase I Reference Comment
CapillaryFFAP1905.Arai T., Sugie H., et al., 200330. m/0.25 mm/0.25 μm, He, 80. C @ 1. min, 7. K/min; Tend: 210. C

References

Arai T., Sugie H., et al., 2003
Arai T.; Sugie H.; Hiradate S.; Kuwahara S.; Itagaki N.; Nakahata T., Identification of a sex pheromone component of Pseudococcus cryptus, J. Chem. Ecol., 2003, 29, 10, 2213-2223, https://doi.org/10.1023/A:1026214112242 . [all data]