(+)-6,11-Epoxy-eudesmane

Van Den Dool and Kratz RI, non-polar column, custom temperature program

Data compiled by: NIST Mass Spectrometry Data Center, William E. Wallace, director

Column type Capillary
Active phase CP Sil 5 CB
Column length (m) 25.
Carrier gas
Substrate
Column diameter (mm)
Phase thickness (μm)
Program not specified
I 1534.
ReferenceAdio, Paul, et al., 2003
Comment MSDC-RI

References

Adio, Paul, et al., 2003
Adio, A.M.; Paul, C.; König, W.A.; Muhle, H., Volatile constituents in the liverwort Tritomaria polita, Phytochemistry, 2003, 64, 2, 637-644, https://doi.org/10.1016/S0031-9422(03)00298-X . [all data]