Benzene, (2,2-dichloro-1,1,2-trifluoroethyl)

Normal alkane RI, non-polar column, temperature ramp

Data compiled by: NIST Mass Spectrometry Data Center, William E. Wallace, director

Column type Capillary
Active phase 5 % Phenyl silicone
Column length (m)
Carrier gas
Substrate
Column diameter (mm)
Phase thickness (μm)
Tstart (C) 40.
Tend (C)
Heat rate (K/min) 20.
Initial hold (min)
Final hold (min)
I 1091.
ReferenceTiers, 2002
Comment MSDC-RI

References

Tiers, 2002
Tiers, G.vD., Perhaloethyl aromatic compounds and perhaloethenyl aromatic compounds therefrom (United States Patent 6350925), 2002, 7. [all data]