(+)(-)-(E)-β-caryophyllene

Normal alkane RI, polar column, temperature ramp

View large format table.

Column type Active phase I Reference Comment
CapillarySupelcowax-101586.Orav, Kailas, et al., 200260. m/0.2 mm/0.5 μm, He, 2. K/min; Tstart: 70. C; Tend: 220. C

References

Orav, Kailas, et al., 2002
Orav, A.; Kailas, T.; Müürisepp, M., Composition of blackcurrant aroma isolated from leaves, buds, and berries of Ribes nigrum L., Proc. Est. Acad. Sci. Chem., 2002, 51, 4, 225-234. [all data]